Target
Diacylglycerol O-acyltransferase 2
Ligand
BDBM435295
Substrate
Meas. Tech.
Enzymatic Activity Assay
IC50
24.0±n/a nM
Citation
 Imbriglio, JLiang, RLondon, CMarby, KTata, JYou, MXiong, Y Tetrahydroisoquinoline derivatives useful as inhibitors of diacylglyceride O-acyltransferase 2 US Patent  US10568876 Publication Date 2/25/2020 
Target
Name:
Diacylglycerol O-acyltransferase 2
Synonyms:
ARAT DGAT2 Diacylglycerol O-acyltransferase 2 (DGAT2) Retinol O-fatty-acyltransferase
Type:
Multi-pass membrane protein
Mol. Mass.:
43848.90
Organism:
Homo sapiens (Human)
Description:
Q96PD7
Residue:
388
  
Inhibitor
Name:
BDBM435295
Synonyms:
N-(3-methyl-1,1- dioxidotetrahydrothiophen-3-yl)-8-((2-(3- methyl-1,2,4-oxadiazol-5-yl) cyclopropanecarboxamido)methyl)-5-(3- (trifluoromethoxy)phenyl)-3,4- dihydroisoquinoline-2(1H)-carboxamide (mixture of 4 isomers) | US10568876, Example 58
Type:
Small organic molecule
Emp. Form.:
C30H32F3N5O6S
Mol. Mass.:
647.665
SMILES:
Cc1noc(n1)C1CC1C(=O)NCc1ccc(-c2cccc(OC(F)(F)F)c2)c2CCN(Cc12)C(=O)NC1(C)CCS(=O)(=O)C1
: