Target
Diacylglycerol O-acyltransferase 2
Ligand
BDBM435304
Substrate
Meas. Tech.
Enzymatic Activity Assay
IC50
13.6±n/a nM
Citation
 Imbriglio, JLiang, RLondon, CMarby, KTata, JYou, MXiong, Y Tetrahydroisoquinoline derivatives useful as inhibitors of diacylglyceride O-acyltransferase 2 US Patent  US10568876 Publication Date 2/25/2020 
Target
Name:
Diacylglycerol O-acyltransferase 2
Synonyms:
ARAT DGAT2 Diacylglycerol O-acyltransferase 2 (DGAT2) Retinol O-fatty-acyltransferase
Type:
Multi-pass membrane protein
Mol. Mass.:
43848.90
Organism:
Homo sapiens (Human)
Description:
Q96PD7
Residue:
388
  
Inhibitor
Name:
BDBM435304
Synonyms:
8-(((trans)-2-(3-methyl-1,2,4-oxadiazol-5- yl)cyclopropanecarboxamido)methyl)-N- (3-methyloxetan-3-yl)-5-(3- (trifluoromethoxy)phenyl)-3,4- dihydroisoquinoline-2(1H)-carboxamide (mixture of 2 isomers) | US10568876, Example 67
Type:
Small organic molecule
Emp. Form.:
C29H30F3N5O5
Mol. Mass.:
585.5742
SMILES:
Cc1noc(n1)[C@@H]1C[C@H]1C(=O)NCc1ccc(-c2cccc(OC(F)(F)F)c2)c2CCN(Cc12)C(=O)NC1(C)COC1
: