Target
Diacylglycerol O-acyltransferase 2
Ligand
BDBM435308
Substrate
Meas. Tech.
Enzymatic Activity Assay
IC50
22.6±n/a nM
Citation
 Imbriglio, JLiang, RLondon, CMarby, KTata, JYou, MXiong, Y Tetrahydroisoquinoline derivatives useful as inhibitors of diacylglyceride O-acyltransferase 2 US Patent  US10568876 Publication Date 2/25/2020 
Target
Name:
Diacylglycerol O-acyltransferase 2
Synonyms:
ARAT DGAT2 Diacylglycerol O-acyltransferase 2 (DGAT2) Retinol O-fatty-acyltransferase
Type:
Multi-pass membrane protein
Mol. Mass.:
43848.90
Organism:
Homo sapiens (Human)
Description:
Q96PD7
Residue:
388
  
Inhibitor
Name:
BDBM435308
Synonyms:
N-cyclopropyl-5-(3-methoxyphenyl)-8- (((trans2- phenylcyclopropanecarboxamido)methyl)- 3,4-dihydroisoquinoline-2(1H)- carboxamide (mixture of 2 isomers) | US10568876, Example 71
Type:
Small organic molecule
Emp. Form.:
C31H33N3O3
Mol. Mass.:
495.612
SMILES:
COc1cccc(c1)-c1ccc(CNC(=O)[C@@H]2C[C@H]2c2ccccc2)c2CN(CCc12)C(=O)NC1CC1
: