Target
Diacylglycerol O-acyltransferase 2
Ligand
BDBM435324
Substrate
Meas. Tech.
Enzymatic Activity Assay
IC50
2286±n/a nM
Citation
 Imbriglio, JLiang, RLondon, CMarby, KTata, JYou, MXiong, Y Tetrahydroisoquinoline derivatives useful as inhibitors of diacylglyceride O-acyltransferase 2 US Patent  US10568876 Publication Date 2/25/2020 
Target
Name:
Diacylglycerol O-acyltransferase 2
Synonyms:
ARAT DGAT2 Diacylglycerol O-acyltransferase 2 (DGAT2) Retinol O-fatty-acyltransferase
Type:
Multi-pass membrane protein
Mol. Mass.:
43848.90
Organism:
Homo sapiens (Human)
Description:
Q96PD7
Residue:
388
  
Inhibitor
Name:
BDBM435324
Synonyms:
N-((2-(2-(((trans)-2- (methoxymethyl)cyclopentyl)amino)-2- oxoethyl)-5-(3-(trifluoromethoxy)phenyl)- 1,2,3,4-tetrahydroisoquinolin-8-yl)methyl)- 2-(3-methyl-1,2,4-oxadiazol-5- yl)cyclopropanecarboxamide (mixture of 2 isomers) | US10568876, Example 86
Type:
Small organic molecule
Emp. Form.:
C33H38F3N5O5
Mol. Mass.:
641.6805
SMILES:
COC[C@H]1CCC[C@H]1NC(=O)CN1CCc2c(C1)c(CNC(=O)C1CC1c1nc(C)no1)ccc2-c1cccc(OC(F)(F)F)c1
: