Target
cAMP-specific 3',5'-cyclic phosphodiesterase 4B
Ligand
BDBM135814
Substrate
Meas. Tech.
TR-FRET- Based Assay
IC50
12400±n/a nM
Citation
 Mjalli, AMGaddam, BPolisetti, DRKostura, MJGuzel, M Tricyclic compounds as modulators of TNF-alpha synthesis and as PDE4 inhibitors US Patent  US10568888 Publication Date 2/25/2020 
Target
Name:
cAMP-specific 3',5'-cyclic phosphodiesterase 4B
Synonyms:
3',5'-cyclic phosphodiesterase Isoform PDE4B1 PDE4B PDE4B_HUMAN Phosphodiesterase 4B (PDE4B) Phosphodiesterase Type 4 (PDE4B)
Type:
Protein
Mol. Mass.:
83318.87
Organism:
Homo sapiens (Human)
Description:
Q07343
Residue:
736
  
Inhibitor
Name:
BDBM135814
Synonyms:
US10085990, Example 33 US8853226, 33 US9833457, 33
Type:
Small organic molecule
Emp. Form.:
C21H25N3O2
Mol. Mass.:
351.4421
SMILES:
CCn1c(=O)n(C2CCCC2)c2c3cccc(C(C)C)c3ncc2c1=O
: