Target
Leucine-rich repeat serine/threonine-protein kinase 2
Ligand
BDBM384363
Substrate
Meas. Tech.
Biochemical Assay
IC50
<30±n/a nM
Citation
 Estrada, AAFeng, JALyssikatos, JPSweeney, ZKde Vicente Fidalgo, J Compounds, compositions, and methods US Patent  US10590114 Publication Date 3/17/2020 
Target
Name:
Leucine-rich repeat serine/threonine-protein kinase 2
Synonyms:
Dardarin LRRK2_HUMAN Leucine-rich repeat serine/threonine-protein kinase 2 PARK8
Type:
Protein
Mol. Mass.:
286113.20
Organism:
Homo sapiens (Human)
Description:
Q5S007
Residue:
2527
  
Inhibitor
Name:
BDBM384363
Synonyms:
BDBM384372 US11111235, No. 59 US9932325, Example 46
Type:
Small organic molecule
Emp. Form.:
C15H16F5N7
Mol. Mass.:
389.3265
SMILES:
Cc1nn(cc1Nc1ncc(c(NCC(F)F)n1)C(F)(F)F)C(C)(C)C#N
: