Target
Endothelial PAS domain-containing protein 1
Ligand
BDBM372988
Substrate
Meas. Tech.
Scintillation Proximity Assay (SPA)
IC50
67.0±n/a nM
Citation
 Dixon, DDGrina, JJosey, JARizzi, JPSchlachter, STWallace, EMWang, BWehn, PXu, RYang, H Aryl ethers and uses thereof US Patent  US10597366 Publication Date 3/24/2020 
Target
Name:
Endothelial PAS domain-containing protein 1
Synonyms:
BHLHE73 EPAS1_HUMAN MOP2 endothelial PAS domain-containing protein 1
Type:
PROTEIN
Mol. Mass.:
96453.58
Organism:
Homo sapiens (Human)
Description:
ChEMBL_1506501
Residue:
870
  
Inhibitor
Name:
BDBM372988
Synonyms:
US10597366, Compound 41 | US9896418, Compound 41
Type:
Small organic molecule
Emp. Form.:
C14H9Cl2F3O4S
Mol. Mass.:
401.185
SMILES:
OCc1c(Cl)c(Oc2cc(F)cc(Cl)c2)ccc1S(=O)(=O)C(F)F
: