Target
Endothelial PAS domain-containing protein 1
Ligand
BDBM437777
Substrate
Meas. Tech.
Scintillation Proximity Assay (SPA)
IC50
<5.00±n/a nM
Citation
 Dixon, DDGrina, JJosey, JARizzi, JPSchlachter, STWallace, EMWang, BWehn, PXu, RYang, H Aryl ethers and uses thereof US Patent  US10597366 Publication Date 3/24/2020 
Target
Name:
Endothelial PAS domain-containing protein 1
Synonyms:
BHLHE73 EPAS1_HUMAN MOP2 endothelial PAS domain-containing protein 1
Type:
PROTEIN
Mol. Mass.:
96453.58
Organism:
Homo sapiens (Human)
Description:
ChEMBL_1506501
Residue:
870
  
Inhibitor
Name:
BDBM437777
Synonyms:
US10597366, Compound 62
Type:
Small organic molecule
Emp. Form.:
C17H13F2NO4S
Mol. Mass.:
365.351
SMILES:
O[C@@H]1CCc2c1c(ccc2Oc1cc(F)cc(c1)C#N)S(=O)(=O)CF
: