Target
Endothelial PAS domain-containing protein 1
Ligand
BDBM373012
Substrate
Meas. Tech.
Scintillation Proximity Assay (SPA)
IC50
<5.00±n/a nM
Citation
 Dixon, DDGrina, JJosey, JARizzi, JPSchlachter, STWallace, EMWang, BWehn, PXu, RYang, H Aryl ethers and uses thereof US Patent  US10597366 Publication Date 3/24/2020 
Target
Name:
Endothelial PAS domain-containing protein 1
Synonyms:
BHLHE73 EPAS1_HUMAN MOP2 endothelial PAS domain-containing protein 1
Type:
PROTEIN
Mol. Mass.:
96453.58
Organism:
Homo sapiens (Human)
Description:
ChEMBL_1506501
Residue:
870
  
Inhibitor
Name:
BDBM373012
Synonyms:
US10597366, Compound 166 | US9896418, Compound 166
Type:
Small organic molecule
Emp. Form.:
C18H14F3NO4S
Mol. Mass.:
397.368
SMILES:
Cc1cc(Oc2ccc(c3[C@H](O)C(F)(F)Cc23)S(=O)(=O)CF)cc(c1)C#N
: