Target
Endothelial PAS domain-containing protein 1
Ligand
BDBM373043
Substrate
Meas. Tech.
Scintillation Proximity Assay (SPA)
IC50
<5.00±n/a nM
Citation
 Dixon, DDGrina, JJosey, JARizzi, JPSchlachter, STWallace, EMWang, BWehn, PXu, RYang, H Aryl ethers and uses thereof US Patent  US10597366 Publication Date 3/24/2020 
Target
Name:
Endothelial PAS domain-containing protein 1
Synonyms:
BHLHE73 EPAS1_HUMAN MOP2 endothelial PAS domain-containing protein 1
Type:
PROTEIN
Mol. Mass.:
96453.58
Organism:
Homo sapiens (Human)
Description:
ChEMBL_1506501
Residue:
870
  
Inhibitor
Name:
BDBM373043
Synonyms:
US10597366, Compound 304 | US9896418, Compound 304
Type:
Small organic molecule
Emp. Form.:
C16H12BrF3O4S
Mol. Mass.:
437.228
SMILES:
CS(=O)(=O)c1ccc(Oc2cc(F)cc(Br)c2)c2CC(F)(F)[C@@H](O)c12
: