Target
Endothelial PAS domain-containing protein 1
Ligand
BDBM438076
Substrate
Meas. Tech.
Scintillation Proximity Assay (SPA)
IC50
7.00±n/a nM
Citation
 Dixon, DDGrina, JJosey, JARizzi, JPSchlachter, STWallace, EMWang, BWehn, PXu, RYang, H Aryl ethers and uses thereof US Patent  US10597366 Publication Date 3/24/2020 
Target
Name:
Endothelial PAS domain-containing protein 1
Synonyms:
BHLHE73 EPAS1_HUMAN MOP2 endothelial PAS domain-containing protein 1
Type:
PROTEIN
Mol. Mass.:
96453.58
Organism:
Homo sapiens (Human)
Description:
ChEMBL_1506501
Residue:
870
  
Inhibitor
Name:
BDBM438076
Synonyms:
US10597366, Compound 331
Type:
Small organic molecule
Emp. Form.:
C15H11ClF3NO4S
Mol. Mass.:
393.765
SMILES:
CS(=O)(=O)c1ccc(Oc2cncc(Cl)c2)c2[C@@H](F)C(F)(F)[C@@H](O)c12
: