Target
Tyrosine-protein kinase HCK
Ligand
BDBM375276
Substrate
Meas. Tech.
In Vitro Activity Assay
IC50
7.40±n/a nM
Citation
 Treon, SPBuhrlage, SJGray, NSTan, LYang, G Methods to treat lymphoplasmacytic lymphoma US Patent  US10597387 Publication Date 3/24/2020 
Target
Name:
Tyrosine-protein kinase HCK
Synonyms:
HCK Hematopoietic cell kinase p59-HCK/p60-HCK p61Hck
Type:
Enzyme Catalytic Domain
Mol. Mass.:
59600.18
Organism:
Homo sapiens (Human)
Description:
P08631
Residue:
526
  
Inhibitor
Name:
BDBM375276
Synonyms:
US10597387, Compound (I-1) | US9908872, Compound (I-1)
Type:
Small organic molecule
Emp. Form.:
C32H32F3N5O2S
Mol. Mass.:
607.689
SMILES:
CCN1CCN(Cc2ccc(cc2C(F)(F)F)C(=O)Nc2ccc(C)c(NC(=O)c3cncc(c3)-c3cccs3)c2)CC1
: