Target
Tyrosine-protein kinase HCK
Ligand
BDBM375281
Substrate
Meas. Tech.
In Vitro Activity Assay
IC50
22.8±n/a nM
Citation
 Treon, SPBuhrlage, SJGray, NSTan, LYang, G Methods to treat lymphoplasmacytic lymphoma US Patent  US10597387 Publication Date 3/24/2020 
Target
Name:
Tyrosine-protein kinase HCK
Synonyms:
HCK Hematopoietic cell kinase p59-HCK/p60-HCK p61Hck
Type:
Enzyme Catalytic Domain
Mol. Mass.:
59600.18
Organism:
Homo sapiens (Human)
Description:
P08631
Residue:
526
  
Inhibitor
Name:
BDBM375281
Synonyms:
US10597387, Compound (I-4) | US9908872, Compound (I-4)
Type:
Small organic molecule
Emp. Form.:
C30H28F3N5O2S
Mol. Mass.:
579.636
SMILES:
CN1CCN(CC1)c1cc(NC(=O)c2ccc(C)c(NC(=O)c3cncc(c3)-c3cccs3)c2)cc(c1)C(F)(F)F
: