Target
Tyrosine-protein kinase BTK
Ligand
BDBM375299
Substrate
Meas. Tech.
In Vitro Activity Assay
IC50
3910±n/a nM
Citation
 Treon, SPBuhrlage, SJGray, NSTan, LYang, G Methods to treat lymphoplasmacytic lymphoma US Patent  US10597387 Publication Date 3/24/2020 
Target
Name:
Tyrosine-protein kinase BTK
Synonyms:
AGMX1 Agammaglobulinaemia tyrosine kinase B cell progenitor kinase BPK BTK_HUMAN Tyrosine Kinase BTK Tyrosine-protein kinase BTK (BTK)
Type:
Enzyme
Mol. Mass.:
76289.95
Organism:
Homo sapiens (Human)
Description:
Q06187
Residue:
659
  
Inhibitor
Name:
BDBM375299
Synonyms:
US10597387, Compound (I-5) | US9908872, Compound (I-5)
Type:
Small organic molecule
Emp. Form.:
C31H30F3N5O2S
Mol. Mass.:
593.662
SMILES:
CCN1CCN(CC1)c1ccc(NC(=O)c2ccc(C)c(NC(=O)c3cncc(c3)-c3cccs3)c2)cc1C(F)(F)F
: