Target
Nuclear receptor subfamily 2 group C member 2
Ligand
BDBM375299
Substrate
Meas. Tech.
In Vitro Activity Assay
IC50
>10000±n/a nM
Citation
 Treon, SPBuhrlage, SJGray, NSTan, LYang, G Methods to treat lymphoplasmacytic lymphoma US Patent  US10597387 Publication Date 3/24/2020 
Target
Name:
Nuclear receptor subfamily 2 group C member 2
Synonyms:
NR2C2 Nuclear receptor subfamily 2 group C member 2 TAK1 | TR4
Type:
PROTEIN
Mol. Mass.:
65411.75
Organism:
Homo sapiens (Human)
Description:
ChEMBL_1476357
Residue:
596
  
Inhibitor
Name:
BDBM375299
Synonyms:
US10597387, Compound (I-5) | US9908872, Compound (I-5)
Type:
Small organic molecule
Emp. Form.:
C31H30F3N5O2S
Mol. Mass.:
593.662
SMILES:
CCN1CCN(CC1)c1ccc(NC(=O)c2ccc(C)c(NC(=O)c3cncc(c3)-c3cccs3)c2)cc1C(F)(F)F
: