Target
Tyrosine-protein kinase HCK
Ligand
BDBM375308
Substrate
Meas. Tech.
In Vitro Activity Assay
IC50
56.5±n/a nM
Citation
 Treon, SPBuhrlage, SJGray, NSTan, LYang, G Methods to treat lymphoplasmacytic lymphoma US Patent  US10597387 Publication Date 3/24/2020 
Target
Name:
Tyrosine-protein kinase HCK
Synonyms:
HCK Hematopoietic cell kinase p59-HCK/p60-HCK p61Hck
Type:
Enzyme Catalytic Domain
Mol. Mass.:
59600.18
Organism:
Homo sapiens (Human)
Description:
P08631
Residue:
526
  
Inhibitor
Name:
BDBM375308
Synonyms:
US10597387, Compound (I-7) | US9908872, Compound (I-7)
Type:
Small organic molecule
Emp. Form.:
C32H33N5O4S
Mol. Mass.:
583.701
SMILES:
Cc1ccc(cc1NC(=O)c1cncc(c1)-c1cccs1)C(=O)Nc1cc(cc(c1)N1CCOCC1)N1CCOCC1
: