Target
Tyrosine-protein kinase HCK
Ligand
BDBM163700
Substrate
Meas. Tech.
In Vitro Activity Assay
IC50
2.43±n/a nM
Citation
 Treon, SPBuhrlage, SJGray, NSTan, LYang, G Methods to treat lymphoplasmacytic lymphoma US Patent  US10597387 Publication Date 3/24/2020 
Target
Name:
Tyrosine-protein kinase HCK
Synonyms:
HCK Hematopoietic cell kinase p59-HCK/p60-HCK p61Hck
Type:
Enzyme Catalytic Domain
Mol. Mass.:
59600.18
Organism:
Homo sapiens (Human)
Description:
P08631
Residue:
526
  
Inhibitor
Name:
BDBM163700
Synonyms:
N-(5-((4-((4-ethylpiperazin-1-yl)methyl)-3-(trifluoromethyl)phenyl)carbamoyl)-2-methylphenyl)-5-(1-methyl-1H-pyrazol-4-yl)nicotinamide (5) | US10597387, Compound (I-9)
Type:
Small organic molecule
Emp. Form.:
C32H34F3N7O2
Mol. Mass.:
605.6533
SMILES:
CCN1CCN(Cc2ccc(NC(=O)c3ccc(C)c(NC(=O)c4cncc(c4)-c4cnn(C)c4)c3)cc2C(F)(F)F)CC1
: