Target
Metabotropic glutamate receptor 1
Ligand
BDBM438368
Substrate
Meas. Tech.
In Vitro Activity Test for mGluR5
IC50
>100000±n/a nM
Citation
 Liu, HZhou, YZhang, DLi, JJiang, HChen, K 5-aromatic alkynyl substituted benzamide compound and preparation method, pharmaceutical composition, and use thereof US Patent  US10618900 Publication Date 4/14/2020 
Target
Name:
Metabotropic glutamate receptor 1
Synonyms:
GPRC1A GRM1_HUMAN Metabotropic Glutamate 1a | metabotropic glutamate 1
Type:
Enzyme
Mol. Mass.:
132358.19
Organism:
Homo sapiens (Human)
Description:
Q13255
Residue:
1194
  
Inhibitor
Name:
BDBM438368
Synonyms:
3-((2-methylthiazol-4-ylethynyl)-N- phenylbenzamide | US10618900, No. ZD014
Type:
Small organic molecule
Emp. Form.:
C19H14N2OS
Mol. Mass.:
318.392
SMILES:
Cc1nc(cs1)C#Cc1cccc(c1)C(=O)Nc1ccccc1
: