Target
High affinity nerve growth factor receptor
Ligand
BDBM374712
Substrate
Meas. Tech.
Kinase Binding Assays
Kd
1900±n/a nM
Citation
 Cui, JJLi, YRogers, EWZhai, D Diaryl macrocycles as modulators of protein kinases US Patent  US10618912 Publication Date 4/14/2020 
Target
Name:
High affinity nerve growth factor receptor
Synonyms:
2.7.10.1 NTRK1 NTRK1_HUMAN Neurotrophic tyrosine kinase receptor type 1 Synonyms=MTC TRK1-transforming tyrosine kinase protein TRKA GN Trk-A Tropomyosin-related kinase A Tyrosine kinase receptor Tyrosine kinase receptor A Tyrosine kinase receptor A (Trk-A) gp140trk | p140-TrkA
Type:
Mol. Mass.:
87498.18
Organism:
Homo sapiens (Human)
Description:
P04629
Residue:
796
  
Inhibitor
Name:
BDBM374712
Synonyms:
12-chloro-11-fluoro-13-methyl-6,7-dihydro- 13H-1,15-ethenopyrazolo[4,3-f][1,10,4,8] benzodioxadiazacyclotridecin-4(5H)-one US10618912, Example 11-1
Type:
Small organic molecule
Emp. Form.:
C17H14ClFN4O3
Mol. Mass.:
376.769
SMILES:
CC1Oc2ccn3ncc(C(=O)NCCOc4ccc(F)c(Cl)c14)c3n2
: