Target
Tyrosine-protein kinase JAK2
Ligand
BDBM374713
Substrate
Meas. Tech.
Kinase Binding Assays
Kd
4.80±n/a nM
Citation
 Cui, JJLi, YRogers, EWZhai, D Diaryl macrocycles as modulators of protein kinases US Patent  US10618912 Publication Date 4/14/2020 
Target
Name:
Tyrosine-protein kinase JAK2
Synonyms:
JAK-2 JAK2_HUMAN Janus kinase 2 (JAK2) | Janus kinase 2 (a protein tyrosine kinase)
Type:
Protein
Mol. Mass.:
130684.68
Organism:
Homo sapiens (Human)
Description:
O60674
Residue:
1132
  
Inhibitor
Name:
BDBM374713
Synonyms:
11-fluoro-14-methyl-6,7,13,14-tetrahydro- 1,15-ethenopyrazolo[4,3-f][1,4,8,10] benzodioxatriazacyclotridecin-4(5H)-one US10618912, Example 20
Type:
Small organic molecule
Emp. Form.:
C17H16FN5O2
Mol. Mass.:
341.3396
SMILES:
CN1Cc2cc(F)ccc2OCCNC(=O)c2cnn3ccc1nc23
: