Target
Proto-oncogene tyrosine-protein kinase ROS
Ligand
BDBM374713
Substrate
Meas. Tech.
Kinase Binding Assays
Kd
21.0±n/a nM
Citation
 Cui, JJLi, YRogers, EWZhai, D Diaryl macrocycles as modulators of protein kinases US Patent  US10618912 Publication Date 4/14/2020 
Target
Name:
Proto-oncogene tyrosine-protein kinase ROS
Synonyms:
MCF3 Proto-oncogene c-Ros-1 ROS1 Receptor tyrosine kinase c-ros oncogene 1 c-Ros receptor tyrosine kinase
Type:
Enzyme
Mol. Mass.:
263897.39
Organism:
Homo sapiens (Human)
Description:
P08922
Residue:
2347
  
Inhibitor
Name:
BDBM374713
Synonyms:
11-fluoro-14-methyl-6,7,13,14-tetrahydro- 1,15-ethenopyrazolo[4,3-f][1,4,8,10] benzodioxatriazacyclotridecin-4(5H)-one US10618912, Example 20
Type:
Small organic molecule
Emp. Form.:
C17H16FN5O2
Mol. Mass.:
341.3396
SMILES:
CN1Cc2cc(F)ccc2OCCNC(=O)c2cnn3ccc1nc23
: