Target
Tyrosine-protein kinase JAK2
Ligand
BDBM374716
Substrate
Meas. Tech.
Kinase Binding Assays
Kd
2.60±n/a nM
Citation
 Cui, JJLi, YRogers, EWZhai, D Diaryl macrocycles as modulators of protein kinases US Patent  US10618912 Publication Date 4/14/2020 
Target
Name:
Tyrosine-protein kinase JAK2
Synonyms:
JAK-2 JAK2_HUMAN Janus kinase 2 (JAK2) | Janus kinase 2 (a protein tyrosine kinase)
Type:
Protein
Mol. Mass.:
130684.68
Organism:
Homo sapiens (Human)
Description:
O60674
Residue:
1132
  
Inhibitor
Name:
BDBM374716
Synonyms:
10-fluoro-8-methyl-15,16-dihydro-8H-3,6- ethenoimidazo[5,1- f][1,10,4,7,8]benzodioxatriazacyclotridecin- 17(14H)-one US10618912, Example 41
Type:
Small organic molecule
Emp. Form.:
C17H15FN4O3
Mol. Mass.:
342.3244
SMILES:
CC1Oc2ccc3ncc(C(=O)NCCOc4ccc(F)cc14)n3n2
: