Target
High affinity nerve growth factor receptor
Ligand
BDBM374717
Substrate
Meas. Tech.
Kinase Binding Assays
Kd
0.088±n/a nM
Citation
 Cui, JJLi, YRogers, EWZhai, D Diaryl macrocycles as modulators of protein kinases US Patent  US10618912 Publication Date 4/14/2020 
Target
Name:
High affinity nerve growth factor receptor
Synonyms:
2.7.10.1 NTRK1 NTRK1_HUMAN Neurotrophic tyrosine kinase receptor type 1 Synonyms=MTC TRK1-transforming tyrosine kinase protein TRKA GN Trk-A Tropomyosin-related kinase A Tyrosine kinase receptor Tyrosine kinase receptor A Tyrosine kinase receptor A (Trk-A) gp140trk | p140-TrkA
Type:
Mol. Mass.:
87498.18
Organism:
Homo sapiens (Human)
Description:
P04629
Residue:
796
  
Inhibitor
Name:
BDBM374717
Synonyms:
10-fluoro-7-methyl-7,8,15,16-tetrahydro-3,6- ethenoimidazo[5,1- f][1,4,7,8,10]benzoxatetraazacyclotridecin-17(14H)- one US10618912, Example 42
Type:
Small organic molecule
Emp. Form.:
C17H16FN5O2
Mol. Mass.:
341.3396
SMILES:
CN1Cc2cc(F)ccc2OCCNC(=O)c2cnc3ccc1nn23
: