Target
High affinity nerve growth factor receptor
Ligand
BDBM374719
Substrate
Meas. Tech.
Kinase Binding Assays
Kd
0.082±n/a nM
Citation
 Cui, JJLi, YRogers, EWZhai, D Diaryl macrocycles as modulators of protein kinases US Patent  US10618912 Publication Date 4/14/2020 
Target
Name:
High affinity nerve growth factor receptor
Synonyms:
2.7.10.1 NTRK1 NTRK1_HUMAN Neurotrophic tyrosine kinase receptor type 1 Synonyms=MTC TRK1-transforming tyrosine kinase protein TRKA GN Trk-A Tropomyosin-related kinase A Tyrosine kinase receptor Tyrosine kinase receptor A Tyrosine kinase receptor A (Trk-A) gp140trk | p140-TrkA
Type:
Mol. Mass.:
87498.18
Organism:
Homo sapiens (Human)
Description:
P04629
Residue:
796
  
Inhibitor
Name:
BDBM374719
Synonyms:
11-fluoro-14-(propan-2-yl)-6,7,13,14-tetrahydro- 1,15-ethenopyrazolo[4,3- f][1,4,8,10]benzoxatriazacyclotridecin-4(5H)-one US10618912, Example 45
Type:
Small organic molecule
Emp. Form.:
C19H20FN5O2
Mol. Mass.:
369.3928
SMILES:
CC(C)N1Cc2cc(F)ccc2OCCNC(=O)c2cnn3ccc1nc23
: