Target
Tyrosine-protein kinase JAK2
Ligand
BDBM374720
Substrate
Meas. Tech.
Kinase Binding Assays
Kd
24.0±n/a nM
Citation
 Cui, JJLi, YRogers, EWZhai, D Diaryl macrocycles as modulators of protein kinases US Patent  US10618912 Publication Date 4/14/2020 
Target
Name:
Tyrosine-protein kinase JAK2
Synonyms:
JAK-2 JAK2_HUMAN Janus kinase 2 (JAK2) | Janus kinase 2 (a protein tyrosine kinase)
Type:
Protein
Mol. Mass.:
130684.68
Organism:
Homo sapiens (Human)
Description:
O60674
Residue:
1132
  
Inhibitor
Name:
BDBM374720
Synonyms:
14-methyl-6,7,13,14-tetrahydro-1,15- ethenopyrazolo[4,3- f][1,4,8,10]benzoxatriazacyclotridecin-4(5H)-one US10618912, Example 49
Type:
Small organic molecule
Emp. Form.:
C17H17N5O2
Mol. Mass.:
323.3492
SMILES:
CN1Cc2ccccc2OCCNC(=O)c2cnn3ccc1nc23
: