Target
Tyrosine-protein kinase JAK2
Ligand
BDBM374721
Substrate
Meas. Tech.
Kinase Binding Assays
Kd
0.570±n/a nM
Citation
 Cui, JJLi, YRogers, EWZhai, D Diaryl macrocycles as modulators of protein kinases US Patent  US10618912 Publication Date 4/14/2020 
Target
Name:
Tyrosine-protein kinase JAK2
Synonyms:
JAK-2 JAK2_HUMAN Janus kinase 2 (JAK2) | Janus kinase 2 (a protein tyrosine kinase)
Type:
Protein
Mol. Mass.:
130684.68
Organism:
Homo sapiens (Human)
Description:
O60674
Residue:
1132
  
Inhibitor
Name:
BDBM374721
Synonyms:
11-fluoro-6,7,13,14-tetrahydro-1,15- ethenopyrazolo[4,3- f][1,4,8,10]benzoxatriazacyclotridecin-4(5H)-one US10618912, Example 50
Type:
Small organic molecule
Emp. Form.:
C16H14FN5O2
Mol. Mass.:
327.3131
SMILES:
Fc1ccc2OCCNC(=O)c3cnn4ccc(NCc2c1)nc34
: