Target
ALK tyrosine kinase receptor
Ligand
BDBM374724
Substrate
Meas. Tech.
Kinase Binding Assays
Kd
270±n/a nM
Citation
 Cui, JJLi, YRogers, EWZhai, D Diaryl macrocycles as modulators of protein kinases US Patent  US10618912 Publication Date 4/14/2020 
Target
Name:
ALK tyrosine kinase receptor
Synonyms:
ALK ALK_HUMAN CD_antigen: CD246
Type:
Protein
Mol. Mass.:
176453.10
Organism:
Homo sapiens (Human)
Description:
Q9UM73
Residue:
1620
  
Inhibitor
Name:
BDBM374724
Synonyms:
12-chloro-11-fluoro-13-methyl-6,7,13,14- tetrahydro-1,15-ethenopyrazolo[4,3- f][1,4,8,10]benzoxatriazacyclotridecin-4(5H)-one US10618912, Example 52
Type:
Small organic molecule
Emp. Form.:
C17H15ClFN5O2
Mol. Mass.:
375.785
SMILES:
CC1Nc2ccn3ncc(C(=O)NCCOc4ccc(F)c(Cl)c14)c3n2
: