Target
Tyrosine-protein kinase JAK2
Ligand
BDBM374725
Substrate
Meas. Tech.
Kinase Binding Assays
Kd
6.50±n/a nM
Citation
 Cui, JJLi, YRogers, EWZhai, D Diaryl macrocycles as modulators of protein kinases US Patent  US10618912 Publication Date 4/14/2020 
Target
Name:
Tyrosine-protein kinase JAK2
Synonyms:
JAK-2 JAK2_HUMAN Janus kinase 2 (JAK2) | Janus kinase 2 (a protein tyrosine kinase)
Type:
Protein
Mol. Mass.:
130684.68
Organism:
Homo sapiens (Human)
Description:
O60674
Residue:
1132
  
Inhibitor
Name:
BDBM374725
Synonyms:
12-fluoro-15-methyl-5,6,7,8,14,15-hexahydro-4H- 1,16-ethenopyrazolo[4,3- g][1,5,9,11]benzoxatriazacyclotetradecin-4-one US10618912, Example 75
Type:
Small organic molecule
Emp. Form.:
C18H18FN5O2
Mol. Mass.:
355.3662
SMILES:
CN1Cc2cc(F)ccc2OCCCNC(=O)c2cnn3ccc1nc23
: