Target
Signal transducer and activator of transcription 1-alpha/beta
Ligand
BDBM50189926
Substrate
Meas. Tech.
Bioassay Evaluation
IC50
>45900±8300 nM
Citation
 Huryn, DMWipf, PGrandis, JRLaPorte, MGJohnston, PASchurdak, MEColombo, R 6-aryl-7-substituted-3-(1H-pyrazol-5-yl)-7H-[1,2,4]triazolo[3,4-B][1,3,4]thiadiazines as inhibitors of the STAT3 pathway with anti-proliferative activity US Patent  US10618914 Publication Date 4/14/2020 
Target
Name:
Signal transducer and activator of transcription 1-alpha/beta
Synonyms:
STAT1 Signal transducer and activator of transcription 1-alpha/beta Transcription factor ISGF-3 components p91/p84 | signal transducer and activator of transcription 1 isoform alpha
Type:
Cytosolic Transcription Factor
Mol. Mass.:
87327.69
Organism:
Homo sapiens (Human)
Description:
Stat1 was expressed in sf9 cells from a baculovirus encoding the recombinant proteins. Stat1 dimer binds to DNA.
Residue:
750
  
Inhibitor
Name:
BDBM50189926
Synonyms:
CHEMBL3828159 US11111253, Compound 6b
Type:
Small organic molecule
Emp. Form.:
C19H13ClN6S
Mol. Mass.:
392.865
SMILES:
Clc1cccc(c1)C1=Nn2c(SC1)nnc2-c1cc(n[nH]1)-c1ccccc1
: