Target
RAR related orphan receptor B isoform 1
Ligand
BDBM438835
Substrate
Meas. Tech.
RORa, b, and g Binding Inhibitors
Ki
>12500±n/a nM
Citation
 Lugar, III, CWMorphy, JRRichardson, TIRudyk, HCSapmaz, SStites, RE Compounds useful for inhibiting ROR-gamma-t US Patent  US10603320 Publication Date 3/31/2020 
Target
Name:
RAR related orphan receptor B isoform 1
Synonyms:
NR1F2 RAR related orphan receptor B isoform 1 (RORB) RORB cDNA, FLJ93970, Homo sapiens RAR-related orphan receptor B (RORB), mRNA
Type:
Protein
Mol. Mass.:
52081.05
Organism:
Human
Description:
Q58EY0
Residue:
459
  
Inhibitor
Name:
BDBM438835
Synonyms:
N-{[5-(Ethylsulfonyl)pyridin-2-yl]methyl}-1″-(1R)-1-[2-(trifluoromethyl)pyrimidin-5-yl]ethyl-4′H-dispiro[cyclopropane-1,5′-thieno[2,3-c]pyran-7′,4″-piperidine]-2′-carboxamide | US10603320, Example 7
Type:
Small organic molecule
Emp. Form.:
C29H32F3N5O4S2
Mol. Mass.:
635.721
SMILES:
CCS(=O)(=O)c1ccc(CNC(=O)c2cc3CC4(CC4)OC4(CCN(CC4)[C@H](C)c4cnc(nc4)C(F)(F)F)c3s2)nc1
: