Target
Dual specificity tyrosine-phosphorylation-regulated kinase 1A
Ligand
BDBM439225
Substrate
Meas. Tech.
Kinase Assay
EC50
5.00±n/a nM
Citation
 KC, SKMittapalli, GKChiruta, CHofilena, BJMak, CCEastman, BWBollu, V 6-(5-membered heteroaryl)isoquinolin-3-yl carboxamides and preparation and use thereof US Patent  US10604514 Publication Date 3/31/2020 
Target
Name:
Dual specificity tyrosine-phosphorylation-regulated kinase 1A
Synonyms:
DYR1A_HUMAN DYRK1A Dual specificity YAK1-related kinase 1A (Dyrk1A) Dual-specificity tyrosine-phosphorylation regulated kinase 1A HP86 MNBH
Type:
Enzyme
Mol. Mass.:
85616.61
Organism:
Homo sapiens (Human)
Description:
Q13627
Residue:
763
  
Inhibitor
Name:
BDBM439225
Synonyms:
US10604514, Compound 102
Type:
Small organic molecule
Emp. Form.:
C26H31FN6O2
Mol. Mass.:
478.5617
SMILES:
CN1CCN(CC1)C(=O)[C@H]1CCC(CC1)C(=O)Nc1cc2cc(cc(F)c2cn1)-c1cnn(C)c1
: