Target
Fibroblast growth factor receptor 4
Ligand
BDBM261989
Substrate
Meas. Tech.
Enzymatic Assay
IC50
<10±n/a nM
Citation
 Sokolsky, AWu, LYao, W Bicyclic heterocycles as FGFR4 inhibitors US Patent  US10632126 Publication Date 4/28/2020 
Target
Name:
Fibroblast growth factor receptor 4
Synonyms:
CD_antigen: CD334 FGFR4 FGFR4 Fibroblast growth factor receptor JK2 TKF
Type:
Protein
Mol. Mass.:
87957.45
Organism:
Homo sapiens (Human)
Description:
P22455
Residue:
802
  
Inhibitor
Name:
BDBM261989
Synonyms:
3-(2,6-difluoro-3,5- dimethoxyphenyl)-7-(1,3- dimethyl-1H-pyrazol-4-yl)-1- (pyridazin-3-ylmethyl)-3,4- dihydropyrido[4,3-d]pyrimidin- 2(1H)-one US10632126, Example 88 US9708318, 88
Type:
Small organic molecule
Emp. Form.:
C25H23F2N7O3
Mol. Mass.:
507.492
SMILES:
COc1cc(OC)c(F)c(N2Cc3cnc(cc3N(Cc3cccnn3)C2=O)-c2cn(C)nc2C)c1F
: