Target
Plasma kallikrein
Ligand
BDBM416939
Substrate
Meas. Tech.
Activity Assay
Ki
25.1±n/a nM
Citation
 Kotian, PLBabu, YSWu, MChintareddy, VRKumar, VSZhang, W Human plasma kallikrein inhibitors US Patent  US10633345 Publication Date 4/28/2020 
Target
Name:
Plasma kallikrein
Synonyms:
Fletcher factor KLKB1 Kallikrein Plasma kallikrein heavy chain Plasma prekallikrein
Type:
Protein
Mol. Mass.:
71391.16
Organism:
Homo sapiens (Human)
Description:
P03952
Residue:
638
  
Inhibitor
Name:
BDBM416939
Synonyms:
1-(3-(aminomethyl)phenyl)-N-(5-(3-cyclopropyl-1-(2-oxopyridin-1(2H)-yl)propyl)-2-fluorophenyl)-3-(trifluoromethyl)-1H-pyrazole-5-carboxamide US10633345, Compound 248k US11203574, Compound 248k US11685721, Compound 248k | US11708332, Compound 248k
Type:
Small organic molecule
Emp. Form.:
C29H27F4N5O2
Mol. Mass.:
553.5506
SMILES:
NCc1cccc(c1)-n1nc(cc1C(=O)Nc1cc(ccc1F)C(CCC1CC1)n1ccccc1=O)C(F)(F)F
: