Target
Plasma kallikrein
Ligand
BDBM416747
Substrate
Meas. Tech.
Activity Assay
Ki
25.1±n/a nM
Citation
 Kotian, PLBabu, YSWu, MChintareddy, VRKumar, VSZhang, W Human plasma kallikrein inhibitors US Patent  US10633345 Publication Date 4/28/2020 
Target
Name:
Plasma kallikrein
Synonyms:
Fletcher factor KLKB1 Kallikrein Plasma kallikrein heavy chain Plasma prekallikrein
Type:
Protein
Mol. Mass.:
71391.16
Organism:
Homo sapiens (Human)
Description:
P03952
Residue:
638
  
Inhibitor
Name:
BDBM416747
Synonyms:
1-(3-(Aminomethyl)phenyl)-N-(5-((cyclopropylmethoxy)(phenyl)methyl)-2-fluorophenyl)-3-(trifluoromethyl)-1H-pyrazole-5-carboxamide US10633345, Compound 34c US11203574, Compound 37a US11685721, Compound 34c | US11708332, Compound 34c
Type:
Small organic molecule
Emp. Form.:
C29H26F4N4O2
Mol. Mass.:
538.536
SMILES:
NCc1cccc(c1)-n1nc(cc1C(=O)Nc1cc(ccc1F)C(OCC1CC1)c1ccccc1)C(F)(F)F
: