Target
Platelet-derived growth factor receptor beta
Ligand
BDBM365337
Substrate
Meas. Tech.
Kinase Assay
IC50
503±n/a nM
Citation
 Boral, SMalone, TCWang, S Pyridyl benzothiophenes as kinase inhibitors US Patent  US10633373 Publication Date 4/28/2020 
Target
Name:
Platelet-derived growth factor receptor beta
Synonyms:
Beta-type platelet-derived growth factor receptor CD140b antigen PDGF Receptor Substrate PDGFR PDGFR-1 PDGFRB PGFRB_HUMAN Platelet-derived growth factor receptor 1 Platelet-derived growth factor receptor beta (PDGFR-beta) Platelet-derived growth factor receptor beta (PDGFRbeta) | VHL/PDGFRB
Type:
Enzyme
Mol. Mass.:
123922.25
Organism:
Homo sapiens (Human)
Description:
P09619
Residue:
1106
  
Inhibitor
Name:
BDBM365337
Synonyms:
6-amino-5-[5-[5 (benzoylamino)-1-benzothien- 2-yl]nicotinate US10669265, Example 42 | US9868726, Example 42
Type:
Small organic molecule
Emp. Form.:
C22H17N3O3S
Mol. Mass.:
403.454
SMILES:
COC(=O)c1cnc(N)c(c1)-c1cc2cc(NC(=O)c3ccccc3)ccc2s1
: