Target
Ataxin-2
Ligand
BDBM258495
Substrate
Meas. Tech.
Enzyme Inhibition Assay
IC50
729±n/a nM
Citation
 Hunziker, DMattei, PMauser, HPrunotto, MUllmer, C Diazaspirocycloalkane and azaspirocycloalkane US Patent  US10633384 Publication Date 4/28/2020 
Target
Name:
Ataxin-2
Synonyms:
ATX2 ATXN2 Spinocerebellar ataxia type 2 protein Trinucleotide repeat-containing gene 13 protein
Type:
Mol. Mass.:
140337.65
Organism:
Homo sapiens (Human)
Description:
Q99700
Residue:
1313
  
Inhibitor
Name:
BDBM258495
Synonyms:
US10633384, Example 1.17 | US9493486, 1.17
Type:
Small organic molecule
Emp. Form.:
C23H26ClN3O7S2
Mol. Mass.:
556.051
SMILES:
CS(=O)(=O)c1cc(Cl)cc(COC(=O)N2CCC3(CN(C3)C(=O)c3ccc(cc3)S(N)(=O)=O)CC2)c1
: