Target
Ataxin-2
Ligand
BDBM258550
Substrate
Meas. Tech.
Enzyme Inhibition Assay
IC50
332±n/a nM
Citation
 Hunziker, DMattei, PMauser, HPrunotto, MUllmer, C Diazaspirocycloalkane and azaspirocycloalkane US Patent  US10633384 Publication Date 4/28/2020 
Target
Name:
Ataxin-2
Synonyms:
ATX2 ATXN2 Spinocerebellar ataxia type 2 protein Trinucleotide repeat-containing gene 13 protein
Type:
Mol. Mass.:
140337.65
Organism:
Homo sapiens (Human)
Description:
Q99700
Residue:
1313
  
Inhibitor
Name:
BDBM258550
Synonyms:
US10633384, Example 12.12 | US9493486, 12.12
Type:
Small organic molecule
Emp. Form.:
C20H20ClN5O3S
Mol. Mass.:
445.922
SMILES:
Clc1cc(COC(=O)N2CCC3(CN(C3)C(=O)c3ccc4[nH]nnc4c3)CC2)cs1
: