Target
Integrin alpha-5/beta-6
Ligand
BDBM297775
Substrate
Meas. Tech.
Integrin-Ligand Interaction by Reference Inhibitors
IC50
394±0 nM
Citation
 Furuya, TAskew, BC Nonanoic and decanoic acid derivatives and uses thereof US Patent  US10118929 Publication Date 11/6/2018 
Target
Name:
Integrin alpha-5/beta-6
Synonyms:
Integrin alpha-V/alpha-5 | Integrin alpha5beta6
Type:
Enzyme
Mol. Mass.:
Description:
Components:
This complex has 2 components.
Component 1
Name:
Integrin beta-6
Synonyms:
ITB6_HUMAN | ITGB6
Type:
PROTEIN
Mol. Mass.:
85919.61
Organism:
Homo sapiens (Human)
Description:
EBI_10916
Residue:
788
  
Component 2
Name:
Integrin alpha-5
Synonyms:
CD49 antigen-like family member E FNRA Fibronectin receptor subunit alpha ITGA5 Integrin alpha-F | VLA-5
Type:
Single-pass type I membrane protein
Mol. Mass.:
114523.00
Organism:
Homo sapiens (Human)
Description:
Residue:
1049
  
Inhibitor
Name:
BDBM297775
Synonyms:
US10118929, Compound A10
Type:
Small organic molecule
Emp. Form.:
C22H25F3N4O3
Mol. Mass.:
450.4541
SMILES:
OC(=O)CC(N1CCN(CCCCNc2ccccn2)C1=O)c1cccc(c1)C(F)(F)F
: