Target
Ubiquitin carboxyl-terminal hydrolase 30
Ligand
BDBM441720
Substrate
Meas. Tech.
Biochemical Assay
IC50
5500±n/a nM
Citation
 Gibson, KRJones, AKemp, MIMadin, AStockley, MLWhitlock, GAWoodrow, MD Compounds US Patent  US10640498 Publication Date 5/5/2020 
Target
Name:
Ubiquitin carboxyl-terminal hydrolase 30
Synonyms:
Deubiquitinating enzyme 30 USP30 Ubiquitin carboxyl-terminal hydrolase 30 (USP30) Ubiquitin-specific-processing protease 30
Type:
Protein
Mol. Mass.:
58522.90
Organism:
Homo sapiens (Human)
Description:
Q70CQ3
Residue:
517
  
Inhibitor
Name:
BDBM441720
Synonyms:
US10640498, Example 17
Type:
Small organic molecule
Emp. Form.:
C20H19N3O
Mol. Mass.:
317.3844
SMILES:
O=C([C@@H]1CCN(C1)C#N)N1CCc2cc(ccc12)-c1ccccc1
: