Target
Lysine-specific histone demethylase 1A
Ligand
BDBM105508
Substrate
Meas. Tech.
Biochemical Assay
IC50
<50±n/a nM
Citation
 Wu, LKonkol, LCLajkiewicz, NLu, LXu, MYao, WYu, ZZhang, CHe, C Imidazopyridines and imidazopyrazines as LSD1 inhibitors US Patent  US10640503 Publication Date 5/5/2020 
Target
Name:
Lysine-specific histone demethylase 1A
Synonyms:
AOF2 Flavin-containing amine oxidase domain-containing protein 2 KDM1A KIAA0601 Lysine-specific demethylase 1 (LSD1) Lysine-specific histone demethylase 1 (LSD1)
Type:
Enzyme
Mol. Mass.:
92901.01
Organism:
Homo sapiens (Human)
Description:
O60341
Residue:
852
  
Inhibitor
Name:
BDBM105508
Synonyms:
US10047086, 73 US9695168, 73
Type:
Small organic molecule
Emp. Form.:
C28H26F2N4O2
Mol. Mass.:
488.5284
SMILES:
CN1CCC[C@@H](COc2cc(-c3ccc(cc3)C#N)c(-c3cc(F)c(CO)c(F)c3)n3cncc23)C1
: