Target
Lysine-specific histone demethylase 1A
Ligand
BDBM106044
Substrate
Meas. Tech.
Biochemical Assay
IC50
300±n/a nM
Citation
 Wu, LKonkol, LCLajkiewicz, NLu, LXu, MYao, WYu, ZZhang, CHe, C Imidazopyridines and imidazopyrazines as LSD1 inhibitors US Patent  US10640503 Publication Date 5/5/2020 
Target
Name:
Lysine-specific histone demethylase 1A
Synonyms:
AOF2 Flavin-containing amine oxidase domain-containing protein 2 KDM1A KIAA0601 Lysine-specific demethylase 1 (LSD1) Lysine-specific histone demethylase 1 (LSD1)
Type:
Enzyme
Mol. Mass.:
92901.01
Organism:
Homo sapiens (Human)
Description:
O60341
Residue:
852
  
Inhibitor
Name:
BDBM106044
Synonyms:
US10047086, 151 US9695168, 151
Type:
Small organic molecule
Emp. Form.:
C29H31N5O2
Mol. Mass.:
481.5887
SMILES:
CN1CCC[C@@H](COc2cc(-c3ccc(cc3)C#N)c(-c3ccc(nc3)C(C)(C)O)n3cncc23)C1
: