Target
Isocitrate dehydrogenase [NADP] cytoplasmic [R132C]
Ligand
BDBM363617
Substrate
Meas. Tech.
In Vitro Assays
IC50
<100±n/a nM
Citation
 Popovici-Muller, JLemieux, RMTravins, JCai, ZCui, DZhou, D Therapeutically active compositions and their methods of use US Patent  US10640534 Publication Date 5/5/2020 
Target
Name:
Isocitrate dehydrogenase [NADP] cytoplasmic [R132C]
Synonyms:
IDH1 IDH1(R132C) Isocitrate dehydrogenase (IDH1)(R132C) Isocitrate dehydrogenase [NADP] cytoplasmic (IDH1) (R132C) | PICD
Type:
Enzyme Catalytic Domain
Mol. Mass.:
46607.23
Organism:
Homo sapiens (Human)
Description:
O75874[R132C]
Residue:
414
  
Inhibitor
Name:
BDBM363617
Synonyms:
US10640534, Compound 106 US10717764, Compound 106 US11667673, Compound 106 | US9850277, Compound 106
Type:
Small organic molecule
Emp. Form.:
C32H27ClF4N6O3
Mol. Mass.:
655.042
SMILES:
Fc1cc(F)cc(c1)N([C@H](C(=O)NC1CC(F)(F)C1)c1ccccc1Cl)C(=O)[C@@H]1CN(CC(=O)N1c1cc(ccn1)C#N)C1CC1
: