Target
Isocitrate dehydrogenase [NADP] cytoplasmic [R132H]
Ligand
BDBM363628
Substrate
Meas. Tech.
In Vitro Assays
IC50
<100±n/a nM
Citation
 Popovici-Muller, JLemieux, RMTravins, JCai, ZCui, DZhou, D Therapeutically active compositions and their methods of use US Patent  US10640534 Publication Date 5/5/2020 
Target
Name:
Isocitrate dehydrogenase [NADP] cytoplasmic [R132H]
Synonyms:
Cytosolic NADP-isocitrate dehydrogenase (IDH1)(R132H) IDH1 R132H IDHC_HUMAN Isocitrate dehydrogenase 1 mutant (R132H) Isocitrate dehydrogenase [NADP] cytoplasmic (IDH1)(R132H) PICD
Type:
Protein
Mol. Mass.:
46641.74
Organism:
Homo sapiens (Human)
Description:
Human IDH1 R132H (SEQ ID No. 2 in patent). First three are removed. Google patent parsed wrong.
Residue:
414
  
Inhibitor
Name:
BDBM363628
Synonyms:
US10640534, Compound 117 US10717764, Compound 117 US11667673, Compound 117 | US9850277, Compound 117
Type:
Small organic molecule
Emp. Form.:
C28H21ClF4N6O4
Mol. Mass.:
616.951
SMILES:
O[C@@H]1C[C@H](N(C1=O)c1nccc(n1)C#N)C(=O)N([C@H](C(=O)NC1CC(F)(F)C1)c1ccccc1Cl)c1cc(F)cc(F)c1
: