Target
Isocitrate dehydrogenase [NADP] cytoplasmic [R132C]
Ligand
BDBM363637
Substrate
Meas. Tech.
In Vitro Assays
IC50
<100±n/a nM
Citation
 Popovici-Muller, JLemieux, RMTravins, JCai, ZCui, DZhou, D Therapeutically active compositions and their methods of use US Patent  US10640534 Publication Date 5/5/2020 
Target
Name:
Isocitrate dehydrogenase [NADP] cytoplasmic [R132C]
Synonyms:
IDH1 IDH1(R132C) Isocitrate dehydrogenase (IDH1)(R132C) Isocitrate dehydrogenase [NADP] cytoplasmic (IDH1) (R132C) | PICD
Type:
Enzyme Catalytic Domain
Mol. Mass.:
46607.23
Organism:
Homo sapiens (Human)
Description:
O75874[R132C]
Residue:
414
  
Inhibitor
Name:
BDBM363637
Synonyms:
US10640534, Compound 124 US10717764, Compound 124 US11667673, Compound 124 | US9850277, Compound 124
Type:
Small organic molecule
Emp. Form.:
C31H26ClF4N5O4
Mol. Mass.:
644.016
SMILES:
O[C@@H]1C[C@H](N(C1=O)c1cc(ccn1)C#N)C(=O)N([C@@H](C(=O)NC1CCC(F)(F)CC1)c1ccccc1Cl)c1cc(F)cc(F)c1
: