Target
Epidermal growth factor receptor
Ligand
BDBM318870
Substrate
Meas. Tech.
Inhibitory Activity Assay
IC50
<100±n/a nM
Citation
 Qian, XZhu, Y Substituted quinazolines for inhibiting kinase activity US Patent  US10653701 Publication Date 5/19/2020 
Target
Name:
Epidermal growth factor receptor
Synonyms:
EGF Receptor Substrate EGFR_HUMAN ERBB1 Epidermal Growth Factor Receptor erbB-1 Epidermal growth factor receptor (EGFR) HER1 Proto-oncogene c-ErbB-1 Tyrosine-Protein Kinase ErbB-1
Type:
Receptor Kinase Domain
Mol. Mass.:
134279.59
Organism:
Homo sapiens (Human)
Description:
P00533
Residue:
1210
  
Inhibitor
Name:
BDBM318870
Synonyms:
N-(3-(7-methyl-2-((4-(4-methylpiperazin-1-yl)phenyl)amino)quinazolin-8-yl)phenyl)acrylamide US10653701, Compound C034 | US11304957, Compound C034
Type:
Small organic molecule
Emp. Form.:
C29H30N6O
Mol. Mass.:
478.5881
SMILES:
CN1CCN(CC1)c1ccc(Nc2ncc3ccc(C)c(-c4cccc(NC(=O)C=C)c4)c3n2)cc1
: