Target
Mitogen-activated protein kinase kinase kinase 5
Ligand
BDBM443198
Substrate
Meas. Tech.
Kinase Activity Inhibition Assay
IC50
6.40±n/a nM
Citation
 Smith, CRChapman, J ASK1 isoindolin-1-one inhibitors and methods of use thereof US Patent  US10654833 Publication Date 5/19/2020 
Target
Name:
Mitogen-activated protein kinase kinase kinase 5
Synonyms:
ASK1 MAP3K5 MEKK5
Type:
Protein
Mol. Mass.:
154514.93
Organism:
Homo sapiens (Human)
Description:
Q99683
Residue:
1374
  
Inhibitor
Name:
BDBM443198
Synonyms:
US10654833, Compound 111
Type:
Small organic molecule
Emp. Form.:
C25H20FN9O
Mol. Mass.:
481.4844
SMILES:
CC(C)n1cnnc1-c1cccc(n1)N1Cc2ccc(cc2C1=O)-c1cc(ccc1F)-c1nn[nH]n1
: