Target
Coagulation factor XI
Ligand
BDBM298283
Substrate
Meas. Tech.
Factor XIa Assay
IC50
10.5±n/a nM
Citation
 Mertz, ELiu, WEdmondson, SDAli, AGao, YNeelamkavil, SFSo, SMoningka, RSun, WHruza, ABrockunier, LL Factor XIa inhibitors US Patent  US10123995 Publication Date 11/13/2018 
Target
Name:
Coagulation factor XI
Synonyms:
Coagulation factor XIa Coagulation factor XIa light chain FA11_HUMAN Factor XIa PTA | Plasma thromboplastin antecedent
Type:
Enzyme
Mol. Mass.:
70130.58
Organism:
Homo sapiens (Human)
Description:
P03951
Residue:
625
  
Inhibitor
Name:
BDBM298283
Synonyms:
US10123995, Example 6
Type:
Small organic molecule
Emp. Form.:
C23H17ClN6O4
Mol. Mass.:
476.872
SMILES:
OC1C[C@@H](C(=O)Nc2ccc(cc2)C(O)=O)c2ncc(cc12)-c1cc(Cl)ccc1-n1cnnn1
: