Target
Toll-like receptor 7
Ligand
BDBM444267
Substrate
Meas. Tech.
Inhibition Reporter Assay
IC50
1.30±n/a nM
Citation
 Dyckman, AJDodd, DSHaque, TSLombardo, LJMacor, JEMussari, CPPasunoori, LPoss, MAKumar, SRPosy, SLTortolani, DRWhiteley, BKSistla, RKHegde, SRamachandra Reddy, AK Pyridyl substituted indole compounds US Patent  US10660877 Publication Date 5/26/2020 
Target
Name:
Toll-like receptor 7
Synonyms:
ORF Names:UNQ248/PRO285 TLR7_HUMAN | Toll-like receptor 7 (TLR7)
Type:
Enzyme
Mol. Mass.:
120945.35
Organism:
Homo sapiens (Human)
Description:
Q9NYK1
Residue:
1049
  
Inhibitor
Name:
BDBM444267
Synonyms:
US10660877, Example 857
Type:
Small organic molecule
Emp. Form.:
C29H37N5O2
Mol. Mass.:
487.6364
SMILES:
CC(C)c1c([nH]c2ccc(cc12)C1CCN(CC1)C(=O)C(=O)N1CCNCC1)-c1cc(C)nc(C)c1
: