Target
Monoacylglycerol lipase ABHD6
Ligand
BDBM444462
Substrate
Meas. Tech.
Fluorescent Assay
IC50
55±n/a nM
Citation
 Makriyannis, AMalamas, MLamani, MFarah, SI ABHD6 and dual ABHD6/MGL inhibitors and their uses US Patent  US10662159 Publication Date 5/26/2020 
Target
Name:
Monoacylglycerol lipase ABHD6
Synonyms:
2-arachidonoylglycerol hydrolase ABHD6_HUMAN Monoacylglycerol lipase ABHD6
Type:
PROTEIN
Mol. Mass.:
38341.83
Organism:
Homo sapiens (Human)
Description:
ChEMBL_105457
Residue:
337
  
Inhibitor
Name:
BDBM444462
Synonyms:
US10662159, Example 50
Type:
Small organic molecule
Emp. Form.:
C18H18F6N2O5
Mol. Mass.:
456.3363
SMILES:
FC(F)(F)C(OC(=O)N1Cc2ccc(OCC(=O)N3CCOCC3)cc2C1)C(F)(F)F
: