Target
Monoglyceride lipase
Ligand
BDBM444463
Substrate
Meas. Tech.
Fluorescent Assay
IC50
55±n/a nM
Citation
 Makriyannis, AMalamas, MLamani, MFarah, SI ABHD6 and dual ABHD6/MGL inhibitors and their uses US Patent  US10662159 Publication Date 5/26/2020 
Target
Name:
Monoglyceride lipase
Synonyms:
HU-K5 Lysophospholipase-like MGL MGLL_HUMAN
Type:
Hydrolase
Mol. Mass.:
33264.56
Organism:
Homo sapiens (Human)
Description:
Human recombinant MGL (Cayman Chemical, cat# 10008354).
Residue:
303
  
Inhibitor
Name:
BDBM444463
Synonyms:
US10662159, Example 52
Type:
Small organic molecule
Emp. Form.:
C17H14F9NO3
Mol. Mass.:
451.2836
SMILES:
FC(F)(F)C(OC(=O)N1CC2(CC(C2)Oc2cccc(c2)C(F)(F)F)C1)C(F)(F)F
: